Target
Acetylcholinesterase
Ligand
BDBM10503
Substrate
BDBM8959
Meas. Tech.
Enzyme Inhibition Assay
pH
7.8±n/a
Temperature
295.15±n/a K
IC50
3±n/a nM
Citation
 Doucet-Personeni, CBentley, PDFletcher, RJKinkaid, AKryger, GPirard, BTaylor, ATaylor, RTaylor, JViner, RSilman, ISussman, JLGreenblatt, HMLewis, T A structure-based design approach to the development of novel, reversible AChE inhibitors. J Med Chem 44:3203-15 (2001)  
Target
Name:
Acetylcholinesterase
Synonyms:
3.1.1.7 Acetylcholinesterase (AChE) ache
Type:
Mol. Mass.:
65900.74
Organism:
Tetronarce californica (Pacific electric ray) (Torpedo californica)
Description:
P04058
Residue:
586
  
Inhibitor
Name:
BDBM10503
Synonyms:
1-[3-({[(4-amino-5-fluoro-2-methylquinolin-3-yl)methyl]sulfanyl}methyl)phenyl]-2,2,2-trifluoroethan-1-one Aminoquinoline 27
Type:
Small organic molecule
Emp. Form.:
C20H16F4N2OS
Mol. Mass.:
408.412
SMILES:
Cc1nc2cccc(F)c2c(N)c1CSCc1cccc(c1)C(=O)C(F)(F)F
:
Substrate
Name:
BDBM8959
Synonyms:
(2-Mercaptoethyl)trimethylammonium iodide acetate Acetylthiocholine acetylthiocholine chloride | acetylthiocholine iodide
Type:
Small organic molecule
Emp. Form.:
C7H16NOS
Mol. Mass.:
162.272
SMILES:
CC(=O)SCC[N+](C)(C)C
: