Target
Cholinesterase
Ligand
BDBM10623
Substrate
BDBM8978
Meas. Tech.
Cholinesterase Inhibition Assay
IC50
5.0±n/a nM
Citation
 Luo, WYu, QSKulkarni, SSParrish, DAHolloway, HWTweedie, DShafferman, ALahiri, DKBrossi, AGreig, NH Inhibition of human acetyl- and butyrylcholinesterase by novel carbamates of (-)- and (+)-tetrahydrofurobenzofuran and methanobenzodioxepine. J Med Chem 49:2174-85 (2006)  
Target
Name:
Cholinesterase
Synonyms:
Acylcholine acylhydrolase Butyrylcholine esterase (BChE) Butyrylcholinesterase (BuChE) CHLE_HUMAN Cholinesterases Pseudocholinesterase
Type:
Homotetramer
Mol. Mass.:
68422.27
Organism:
Homo sapiens (Human)
Description:
P06276
Residue:
602
  
Inhibitor
Name:
BDBM10623
Synonyms:
(-)Heptylstigmine Eptastigmine
Type:
Small organic molecule
Emp. Form.:
C21H33N3O2
Mol. Mass.:
359.5056
SMILES:
CCCCCCCNC(=O)Oc1ccc2N(C)C3N(C)CC[C@@]3(C)c2c1
:
Substrate
Name:
BDBM8978
Synonyms:
(Propylcarbonylthioethyl)trimethylammonium iodide CHEMBL148530 butyrylthiocholine | butyrylthiocholine chloride
Type:
Small organic molecule
Emp. Form.:
C9H20NOS
Mol. Mass.:
190.326
SMILES:
CCCC(=O)SCC[N+](C)(C)C
: