Target
Fibroblast growth factor receptor 3
Ligand
BDBM301303
Substrate
Meas. Tech.
Enzymatic Assay
IC50
<100±n/a nM
Citation
 Wu, LZhang, CHe, CLu, LYao, W Substituted tricyclic compounds as FGFR inhibitors US Patent  US9611267 Publication Date 4/4/2017 
Target
Name:
Fibroblast growth factor receptor 3
Synonyms:
CD_antigen: CD333 FGFR3 Fibroblast growth factor receptor JTK4
Type:
Protein
Mol. Mass.:
87699.57
Organism:
Homo sapiens (Human)
Description:
P22607
Residue:
806
  
Inhibitor
Name:
BDBM301303
Synonyms:
3-(2,6-difluoro-3,5-dimethoxyphenyl)-8-[(4-ethylpiperazin-1-yl)carbonyl]-1-methyl-1,3,4,7-tetrahydro-2H-pyrrolo[3',2':5,6]pyrido[4,3-d]pyrimidin-2-one US11053246, Example 119 | US9611267, Example 119
Type:
Small organic molecule
Emp. Form.:
C25H28F2N6O4
Mol. Mass.:
514.5244
SMILES:
CCN1CCN(CC1)C(=O)c1cc2c3N(C)C(=O)N(Cc3cnc2[nH]1)c1c(F)c(OC)cc(OC)c1F
: