Target
Fibroblast growth factor receptor 3
Ligand
BDBM301368
Substrate
Meas. Tech.
Enzymatic Assay
IC50
<100±n/a nM
Citation
 Wu, LZhang, CHe, CLu, LYao, W Substituted tricyclic compounds as FGFR inhibitors US Patent  US9611267 Publication Date 4/4/2017 
Target
Name:
Fibroblast growth factor receptor 3
Synonyms:
CD_antigen: CD333 FGFR3 Fibroblast growth factor receptor JTK4
Type:
Protein
Mol. Mass.:
87699.57
Organism:
Homo sapiens (Human)
Description:
P22607
Residue:
806
  
Inhibitor
Name:
BDBM301368
Synonyms:
3-(2,6-difluoro-3,5-dimethoxyphenyl)-8-(morpholin-4-ylmethyl)-1-propyl-1,3,4,7-tetrahydro-2H-pyrrolo[3',2':5,6]pyrido[4,3-d]pyrimidin-2-one US11053246, Example 184 | US9611267, Example 184
Type:
Small organic molecule
Emp. Form.:
C25H29F2N5O4
Mol. Mass.:
501.5257
SMILES:
CCCN1C(=O)N(Cc2cnc3[nH]c(CN4CCOCC4)cc3c12)c1c(F)c(OC)cc(OC)c1F
: