Target
Acetylcholinesterase
Ligand
BDBM10796
Substrate
BDBM10759
Meas. Tech.
Cholinesterase Inhibition Assay
IC50
13±n/a nM
Citation
 Sterling, JHerzig, YGoren, TFinkelstein, NLerner, DGoldenberg, WMiskolczi, IMolnar, SRantal, FTamas, TToth, GZagyva, AZekany, AFinberg, JLavian, GGross, AFriedman, RRazin, MHuang, WKrais, BChorev, MYoudim, MBWeinstock, M Novel dual inhibitors of AChE and MAO derived from hydroxy aminoindan and phenethylamine as potential treatment for Alzheimer's disease. J Med Chem 45:5260-79 (2002)  
Target
Name:
Acetylcholinesterase
Synonyms:
ACES_HUMAN Acetylcholinesterase (AChE) | Acetylcholinesterase (human AChE)
Type:
Enzyme
Mol. Mass.:
67792.70
Organism:
Homo sapiens (Human)
Description:
P22303
Residue:
614
  
Inhibitor
Name:
BDBM10796
Synonyms:
1-(dimethylamino)-2,3-dihydro-1H-inden-4-yl N,N-dimethylcarbamate | Aminoindan deriv. 32a
Type:
Small organic molecule
Emp. Form.:
C14H20N2O2
Mol. Mass.:
248.3208
SMILES:
CN(C)C1CCc2c1cccc2OC(=O)N(C)C
:
Substrate
Name:
BDBM10759
Synonyms:
2-acetoxyethyl(trimethyl)ammonium;bromide CHEMBL667 [2-(acetyloxy)ethyl]trimethylazanium acetylcholine chloride | cid_6060
Type:
Small Organic Molecule
Emp. Form.:
C7H16NO2
Mol. Mass.:
146.2069
SMILES:
CC(=O)OCC[N+](C)(C)C
: