Target
Acetylcholinesterase
Ligand
BDBM10812
Substrate
BDBM10759
Meas. Tech.
Cholinesterase Inhibition Assay
IC50
160±n/a nM
Citation
 Sterling, JHerzig, YGoren, TFinkelstein, NLerner, DGoldenberg, WMiskolczi, IMolnar, SRantal, FTamas, TToth, GZagyva, AZekany, AFinberg, JLavian, GGross, AFriedman, RRazin, MHuang, WKrais, BChorev, MYoudim, MBWeinstock, M Novel dual inhibitors of AChE and MAO derived from hydroxy aminoindan and phenethylamine as potential treatment for Alzheimer's disease. J Med Chem 45:5260-79 (2002)  
Target
Name:
Acetylcholinesterase
Synonyms:
ACES_HUMAN Acetylcholinesterase (AChE) | Acetylcholinesterase (human AChE)
Type:
Enzyme
Mol. Mass.:
67792.70
Organism:
Homo sapiens (Human)
Description:
P22303
Residue:
614
  
Inhibitor
Name:
BDBM10812
Synonyms:
3-[2-(dimethylamino)ethyl]phenyl N,N-dimethylcarbamate | Phenethylamine deriv. 48a
Type:
Small organic molecule
Emp. Form.:
C13H20N2O2
Mol. Mass.:
236.3101
SMILES:
CN(C)CCc1cccc(OC(=O)N(C)C)c1
:
Substrate
Name:
BDBM10759
Synonyms:
2-acetoxyethyl(trimethyl)ammonium;bromide CHEMBL667 [2-(acetyloxy)ethyl]trimethylazanium acetylcholine chloride | cid_6060
Type:
Small Organic Molecule
Emp. Form.:
C7H16NO2
Mol. Mass.:
146.2069
SMILES:
CC(=O)OCC[N+](C)(C)C
: