Target
Proto-oncogene tyrosine-protein kinase receptor Ret [658-1114,V804M]
Ligand
BDBM305021
Substrate
Meas. Tech.
A RET Enzyme Assay
IC50
39.3±n/a nM
Citation
 Andrews, SWAronow, SBlake, JFBrandhuber, BJCollier, JCook, AHaas, JJiang, YKolakowski, GRMcFaddin, EAMcKenney, MLMcNulty, OTMetcalf, ATMoreno, DARamann, GATang, TPRen, LWalls, SM Substituted pyrazolo[1,5-A]pyridine compounds as RET kinase inhibitors US Patent  US10172845 Publication Date 1/8/2019 
Target
Name:
Proto-oncogene tyrosine-protein kinase receptor Ret [658-1114,V804M]
Synonyms:
CDHF12 PTC Proto-oncogene tyrosine-protein kinase receptor Ret (V804M) RET Kinase (V804M) (aa658-end) RET_HUMAN
Type:
Enzyme Catalytic Domain
Mol. Mass.:
51567.23
Organism:
Homo sapiens (Human)
Description:
P07949[658-1114,V804M]
Residue:
457
  
Inhibitor
Name:
BDBM305021
Synonyms:
4-(6-(4-(4- fluorophenoxy) piperidin-1-yl)pyridin- 3-yl)-6-(2-hydroxy-2- methylpropoxy) pyrazolo[1,5-a] pyridine-3- carbonitrile US10172845, Example 37 US10881652, Example 37 | US11648243, Example 37
Type:
Small organic molecule
Emp. Form.:
C28H28FN5O3
Mol. Mass.:
501.552
SMILES:
CC(C)(O)COc1cc(-c2ccc(nc2)N2CCC(CC2)Oc2ccc(F)cc2)c2c(cnn2c1)C#N
: