Target
Proto-oncogene tyrosine-protein kinase receptor Ret [658-1114,V804M]
Ligand
BDBM305432
Substrate
Meas. Tech.
A RET Enzyme Assay
IC50
1111±n/a nM
Citation
 Andrews, SWAronow, SBlake, JFBrandhuber, BJCollier, JCook, AHaas, JJiang, YKolakowski, GRMcFaddin, EAMcKenney, MLMcNulty, OTMetcalf, ATMoreno, DARamann, GATang, TPRen, LWalls, SM Substituted pyrazolo[1,5-A]pyridine compounds as RET kinase inhibitors US Patent  US10172845 Publication Date 1/8/2019 
Target
Name:
Proto-oncogene tyrosine-protein kinase receptor Ret [658-1114,V804M]
Synonyms:
CDHF12 PTC Proto-oncogene tyrosine-protein kinase receptor Ret (V804M) RET Kinase (V804M) (aa658-end) RET_HUMAN
Type:
Enzyme Catalytic Domain
Mol. Mass.:
51567.23
Organism:
Homo sapiens (Human)
Description:
P07949[658-1114,V804M]
Residue:
457
  
Inhibitor
Name:
BDBM305432
Synonyms:
US10144734, Example 449 US10441581, Example 449 US11648243, Example 449
Type:
Small organic molecule
Emp. Form.:
C29H31FN6O
Mol. Mass.:
498.5944
SMILES:
CCOc1cc(-c2ccc(nc2)N2CCC(C)(CC2)NCc2cc(F)ccc2C)c2c(cnn2c1)C#N
: