Target
Proto-oncogene tyrosine-protein kinase receptor Ret [658-1114]
Ligand
BDBM305756
Substrate
Meas. Tech.
A RET Enzyme Assay
IC50
8.00±n/a nM
Citation
 Andrews, SWAronow, SBlake, JFBrandhuber, BJCollier, JCook, AHaas, JJiang, YKolakowski, GRMcFaddin, EAMcKenney, MLMcNulty, OTMetcalf, ATMoreno, DARamann, GATang, TPRen, LWalls, SM Substituted pyrazolo[1,5-A]pyridine compounds as RET kinase inhibitors US Patent  US10172845 Publication Date 1/8/2019 
Target
Name:
Proto-oncogene tyrosine-protein kinase receptor Ret [658-1114]
Synonyms:
CDHF12 PTC Proto-oncogene tyrosine-protein kinase receptor Ret (aa 658-1114) RET Kinase (aa 658-1114) RET_HUMAN
Type:
Mol. Mass.:
51535.16
Organism:
Homo sapiens (Human)
Description:
P07949[658-1114]
Residue:
457
  
Inhibitor
Name:
BDBM305756
Synonyms:
3-chloro-N-(1-(5-(3- cyano-6- ethoxypyrazolo[1,5- a]pyridin-4-yl)pyrazin-2- yl)-4-methylpiperidin-4- yl)picolinamide US10172845, Example 774 US10881652, Example 774 | US11648243, Example 774
Type:
Small organic molecule
Emp. Form.:
C26H25ClN8O2
Mol. Mass.:
516.982
SMILES:
CCOc1cc(-c2cnc(cn2)N2CCC(C)(CC2)NC(=O)c2ncccc2Cl)c2c(cnn2c1)C#N
: