Target
Proto-oncogene tyrosine-protein kinase receptor Ret [658-1114]
Ligand
BDBM296344
Substrate
Meas. Tech.
RET Enzyme Assay
IC50
277±n/a nM
Citation
 Andrews, SWAronow, SBlake, JFBrandhuber, BJCook, AHaas, JJiang, YKolakowski, GRMcFaddin, EAMcKenney, MLMcNulty, OTMetcalf, ATMoreno, DATang, TPRen, L Substituted pyrazolo[1,5-A]pyridine compounds as RET kinase inhibitors US Patent  US10172851 Publication Date 1/8/2019 
Target
Name:
Proto-oncogene tyrosine-protein kinase receptor Ret [658-1114]
Synonyms:
CDHF12 PTC Proto-oncogene tyrosine-protein kinase receptor Ret (aa 658-1114) RET Kinase (aa 658-1114) RET_HUMAN
Type:
Mol. Mass.:
51535.16
Organism:
Homo sapiens (Human)
Description:
P07949[658-1114]
Residue:
457
  
Inhibitor
Name:
BDBM296344
Synonyms:
4-(6-(4-((6- methoxypyridin- 3- yl)methyl) piperazin-1- yl)pyridin-3- yl)-6- (neopentyloxy) pyrazolo[1,5- a]pyridine-3- carbonitrile US10137124, Example 77 US10555944, Example 77 | US10953005, Example 77
Type:
Small organic molecule
Emp. Form.:
C29H33N7O2
Mol. Mass.:
511.618
SMILES:
COc1ccc(CN2CCN(CC2)c2ccc(cn2)-c2cc(OCC(C)(C)C)cn3ncc(C#N)c23)cn1
: