Target
Proto-oncogene tyrosine-protein kinase receptor Ret [658-1114,V804M]
Ligand
BDBM296351
Substrate
Meas. Tech.
RET Enzyme Assay
IC50
748±n/a nM
Citation
 Andrews, SWAronow, SBlake, JFBrandhuber, BJCook, AHaas, JJiang, YKolakowski, GRMcFaddin, EAMcKenney, MLMcNulty, OTMetcalf, ATMoreno, DATang, TPRen, L Substituted pyrazolo[1,5-A]pyridine compounds as RET kinase inhibitors US Patent  US10172851 Publication Date 1/8/2019 
Target
Name:
Proto-oncogene tyrosine-protein kinase receptor Ret [658-1114,V804M]
Synonyms:
CDHF12 PTC Proto-oncogene tyrosine-protein kinase receptor Ret (V804M) RET Kinase (V804M) (aa658-end) RET_HUMAN
Type:
Enzyme Catalytic Domain
Mol. Mass.:
51567.23
Organism:
Homo sapiens (Human)
Description:
P07949[658-1114,V804M]
Residue:
457
  
Inhibitor
Name:
BDBM296351
Synonyms:
6- (cyclobutylmethoxy)- 4-(6-(4-((6- methoxypyridin- 3- yl)methyl) piperazin-1-yl) pyridin-3- yl)pyrazolo[1,5- a]pyridine-3- carbonitrile US10137124, Example 84 US10555944, Example 84 | US10953005, Example 84
Type:
Small organic molecule
Emp. Form.:
C29H31N7O2
Mol. Mass.:
509.6021
SMILES:
COc1ccc(CN2CCN(CC2)c2ccc(cn2)-c2cc(OCC3CCC3)cn3ncc(C#N)c23)cn1
: