Target
Amine oxidase [flavin-containing] B
Ligand
BDBM254556
Substrate
Meas. Tech.
Monoamine Oxidase Assays
Ki
20500±n/a nM
Citation
 Ortega Muñoz, AFyfe, MCMartinell Pedemonte, MEstiarte Martinez, MValls Vidal, NKurz, GCastro Palomino Laria, JC (Hetero)aryl cyclopropylamine compounds as LSD1 inhibitors US Patent  US9670136 Publication Date 6/6/2017 
Target
Name:
Amine oxidase [flavin-containing] B
Synonyms:
AOFB_HUMAN MAOB Monoamine oxidase type B (MAO B) Monoamine oxidase type B (MAOB)
Type:
Protein
Mol. Mass.:
58768.76
Organism:
Homo sapiens (Human)
Description:
P27338
Residue:
520
  
Inhibitor
Name:
BDBM254556
Synonyms:
US10214477, Example 15 US9670136, 15 (R)-1-(4-(((trans)-2-phenylcyclopropyl)amino)cyclohexyl)pyrrolidin-3-amine trihydrochloride
Type:
Small organic molecule
Emp. Form.:
C19H29N3
Mol. Mass.:
299.4537
SMILES:
N[C@@H]1CCN(C1)C1CCC(CC1)N[C@H]1C[C@@H]1c1ccccc1
: