Target
Lysine-specific histone demethylase 1A
Ligand
BDBM183458
Substrate
Meas. Tech.
LSD1 Assays
pH
7.4±n/a
Temperature
298.15±n/a K
IC50
19±n/a nM
Comments
extracted
Citation
 Ortega Muñoz, AFyfe, MCMartinell Pedemonte, MEstiarte Martinez, MValls Vidal, NKurz, GCastro Palomino Laria, JC (Hetero)aryl cyclopropylamine compounds as LSD1 inhibitors US Patent  US9670136 Publication Date 6/6/2017 
Target
Name:
Lysine-specific histone demethylase 1A
Synonyms:
AOF2 Flavin-containing amine oxidase domain-containing protein 2 KDM1A KIAA0601 Lysine-specific demethylase 1 (LSD1) Lysine-specific histone demethylase 1 (LSD1)
Type:
Enzyme
Mol. Mass.:
92901.01
Organism:
Homo sapiens (Human)
Description:
O60341
Residue:
852
  
Inhibitor
Name:
BDBM183458
Synonyms:
US9670136, 52 N-(4′-((trans)-2-((4-aminocyclohexyl)amino)cyclopropyl)-[1,1′-biphenyl]-3-yl)piperazine-1-sulfonamide
Type:
Small organic molecule
Emp. Form.:
C25H35N5O2S
Mol. Mass.:
469.643
SMILES:
NC1CCC(CC1)NC1C[C@@H]1c1ccc(cc1)-c1cccc(NS(=O)(=O)N2CCNCC2)c1
: