Target
Vasopressin V1a receptor
Ligand
BDBM316329
Substrate
Meas. Tech.
Binding Assay
Ki
5.5±n/a nM
Citation
 Braje, WFroggett, JGeneste, HHornberger, WJantos, KKling, Avan Gaalen, M Fused heterocyclic or carbocyclic compounds carrying a substituted cycloaliphatic radical and use thereof for treating vasopressin-related diseases US Patent  US9617226 Publication Date 4/11/2017 
Target
Name:
Vasopressin V1a receptor
Synonyms:
AVPR V1a AVPR1A V1AR_HUMAN VASOPRESSIN V1A Vasopressin V1 receptor Vasopressin receptor
Type:
Receptor
Mol. Mass.:
46820.18
Organism:
Homo sapiens (Human)
Description:
P37288
Residue:
418
  
Inhibitor
Name:
BDBM316329
Synonyms:
US9617226, Example 10 | cis-2-[2-(3-Chlorophenyl)-6-[3-[(4-methoxy-1-piperidyl)methyl]cyclobutyl]-4-oxo-quinazolin-3-yl]-N-isopropyl-acetamide
Type:
Small organic molecule
Emp. Form.:
C30H37ClN4O3
Mol. Mass.:
537.093
SMILES:
COC1CCN(C[C@H]2C[C@H](C2)c2ccc3nc(-c4cccc(Cl)c4)n(CC(=O)NC(C)C)c(=O)c3c2)CC1
: