Target
Vasopressin V1a receptor
Ligand
BDBM316354
Substrate
Meas. Tech.
Binding Assay
Ki
55±n/a nM
Citation
 Braje, WFroggett, JGeneste, HHornberger, WJantos, KKling, Avan Gaalen, M Fused heterocyclic or carbocyclic compounds carrying a substituted cycloaliphatic radical and use thereof for treating vasopressin-related diseases US Patent  US9617226 Publication Date 4/11/2017 
Target
Name:
Vasopressin V1a receptor
Synonyms:
AVPR V1a AVPR1A V1AR_HUMAN VASOPRESSIN V1A Vasopressin V1 receptor Vasopressin receptor
Type:
Receptor
Mol. Mass.:
46820.18
Organism:
Homo sapiens (Human)
Description:
P37288
Residue:
418
  
Inhibitor
Name:
BDBM316354
Synonyms:
cis-2-[2-(3-Chlorophenyl)-6-[3-[(3-methoxyazetidin-1-yl)methyl]cyclobutyl]-4-oxo-quinazolin-3-yl]-N-isopropyl-acetamide | US9617226, Example 35
Type:
Small organic molecule
Emp. Form.:
C28H33ClN4O3
Mol. Mass.:
509.04
SMILES:
COC1CN(C[C@H]2C[C@H](C2)c2ccc3nc(-c4cccc(Cl)c4)n(CC(=O)NC(C)C)c(=O)c3c2)C1
: