Target
Endochitinase B1 [Y245F]
Ligand
BDBM10850
Substrate
BDBM10852
Meas. Tech.
Enzyme Inhibition Assay
Kd
64000±n/a nM
Citation
 Rao, FVAndersen, OAVora, KADemartino, JAvan Aalten, DM Methylxanthine drugs are chitinase inhibitors: investigation of inhibition and binding modes. Chem Biol 12:973-80 (2005)  
Target
Name:
Endochitinase B1 [Y245F]
Synonyms:
AfChiB1(Y245F) Chitinase Mutant (Y245F) chiB1
Type:
Enzyme
Mol. Mass.:
47596.97
Organism:
Aspergillus fumigatus
Description:
Q873X9[Y245F]
Residue:
433
  
Inhibitor
Name:
BDBM10850
Synonyms:
1-(5-Oxohexyl)theobromine (pentoxifylline) 3,7-dimethyl-1-(5-oxohexyl)-3,7-dihydropurine-2,6-dione Pentoxifylline Pentoxyphylline
Type:
Small organic molecule
Emp. Form.:
C13H18N4O3
Mol. Mass.:
278.307
SMILES:
CC(=O)CCCCn1c(=O)n(C)c2ncn(C)c2c1=O
:
Substrate