Target
Endochitinase B1 [M243A]
Ligand
BDBM10853
Substrate
BDBM10852
Meas. Tech.
Enzyme Inhibition Assay
Kd
1730±n/a nM
Citation
 Rao, FVHouston, DRBoot, RGAerts, JMHodkinson, MAdams, DJShiomi, KOmura, Svan Aalten, DM Specificity and affinity of natural product cyclopentapeptide inhibitors against A. fumigatus, human, and bacterial chitinases. Chem Biol 12:65-76 (2005)  
Target
Name:
Endochitinase B1 [M243A]
Synonyms:
AfChiB1(M243A) Chitinase Mutant (M243A) chiB1
Type:
Enzyme
Mol. Mass.:
47552.85
Organism:
Aspergillus fumigatus
Description:
Q873X9[M243A]
Residue:
433
  
Inhibitor
Name:
BDBM10853
Synonyms:
(2R,5S,8S,11S,15S)-8-benzyl-2,7-dimethyl-5-[3-({[(methylcarbamoyl)amino]methanimidoyl}amino)propyl]-3,6,9,13,17-pentaoxo-1,4,7,10,14-pentaazacycloheptadecane-11,15-dicarboxylic acid | Argifin
Type:
Small organic molecule
Emp. Form.:
C29H41N9O10
Mol. Mass.:
675.6901
SMILES:
CNC(=O)NC(=N)NCCC[C@@H]1NC(=O)[C@@H](C)NC(=O)C[C@H](NC(=O)C[C@H](NC(=O)[C@H](Cc2ccccc2)N(C)C1=O)C(O)=O)C(O)=O
:
Substrate