Target
Poly [ADP-ribose] polymerase tankyrase-2
Ligand
BDBM207557
Substrate
Meas. Tech.
Enzymatic Assay
IC50
154000±n/a nM
Citation
 Zhou, CRen, BWang, H Fused tetra or penta-cyclic dihydrodiazepinocarbazolones as PARP inhibitors US Patent  US9617273 Publication Date 4/11/2017 
Target
Name:
Poly [ADP-ribose] polymerase tankyrase-2
Synonyms:
(ARTD6 or PARP5b) Poly [ADP-ribose] polymerase tankyrase-2 TNKL TNKS2_HUMAN Tankyrase 2 Tankyrase-2 Tankyrase-2 (TNKS2)
Type:
Enzyme
Mol. Mass.:
126937.16
Organism:
Homo sapiens (Human)
Description:
Q9H2K2
Residue:
1166
  
Inhibitor
Name:
BDBM207557
Synonyms:
US9260440, 2 | US9617273, Example 2
Type:
Small organic molecule
Emp. Form.:
C14H13N3O
Mol. Mass.:
239.2725
SMILES:
O=c1[nH]nc2CCCCc3[nH]c4cccc1c4c23
: