Target
Poly [ADP-ribose] polymerase 1
Ligand
BDBM207568
Substrate
Meas. Tech.
Enzymatic Assay
IC50
19800±n/a nM
Citation
 Zhou, CRen, BWang, H Fused tetra or penta-cyclic dihydrodiazepinocarbazolones as PARP inhibitors US Patent  US9617273 Publication Date 4/11/2017 
Target
Name:
Poly [ADP-ribose] polymerase 1
Synonyms:
(ARTD1 or PARP1) 2.4.2.30 ADPRT ARTD1 Human diphtheria toxin-like ADP-ribosyltransferase (ARTD1 or PARP1) NT-PARP-1 PARP1 PPOL Poly [ADP-ribose] polymerase 1 (PARP) Poly [ADP-ribose] polymerase 1 (PARP1) Poly [ADP-ribose] polymerase 1, 28-kDa form Poly [ADP-ribose] polymerase 1, processed C-terminus Poly [ADP-ribose] polymerase-1 Poly(ADP-ribose) polymerase-1 (ARTD1/PARP1) Protein poly-ADP-ribosyltransferase PARP1 | Synonyms=ADPRT
Type:
Mol. Mass.:
113114.22
Organism:
Homo sapiens (Human)
Description:
P09874
Residue:
1014
  
Inhibitor
Name:
BDBM207568
Synonyms:
US10501467, Example 13 US9617273, Example 13
Type:
Small organic molecule
Emp. Form.:
C21H20N4O
Mol. Mass.:
344.4097
SMILES:
CN(C)c1ccc(cc1)C1Cc2[nH]c3cccc4c3c2c(C1)n[nH]c4=O
: