Target
Poly [ADP-ribose] polymerase 1
Ligand
BDBM207591
Substrate
Meas. Tech.
Enzymatic Assay
IC50
350000±n/a nM
Citation
 Zhou, CRen, BWang, H Fused tetra or penta-cyclic dihydrodiazepinocarbazolones as PARP inhibitors US Patent  US9617273 Publication Date 4/11/2017 
Target
Name:
Poly [ADP-ribose] polymerase 1
Synonyms:
(ARTD1 or PARP1) 2.4.2.30 ADPRT ARTD1 Human diphtheria toxin-like ADP-ribosyltransferase (ARTD1 or PARP1) NT-PARP-1 PARP1 PPOL Poly [ADP-ribose] polymerase 1 (PARP) Poly [ADP-ribose] polymerase 1 (PARP1) Poly [ADP-ribose] polymerase 1, 28-kDa form Poly [ADP-ribose] polymerase 1, processed C-terminus Poly [ADP-ribose] polymerase-1 Poly(ADP-ribose) polymerase-1 (ARTD1/PARP1) Protein poly-ADP-ribosyltransferase PARP1 | Synonyms=ADPRT
Type:
Mol. Mass.:
113114.22
Organism:
Homo sapiens (Human)
Description:
P09874
Residue:
1014
  
Inhibitor
Name:
BDBM207591
Synonyms:
US10501467, Example 36 US9617273, Example 36
Type:
Small organic molecule
Emp. Form.:
C19H22N4O2
Mol. Mass.:
338.4036
SMILES:
O=c1[nH]nc2CCCc3n(CCN4CCOCC4)c4cccc1c4c23
: