Target
Poly [ADP-ribose] polymerase 2
Ligand
BDBM207596
Substrate
Meas. Tech.
Enzymatic Assay
IC50
21000±n/a nM
Citation
 Zhou, CRen, BWang, H Fused tetra or penta-cyclic dihydrodiazepinocarbazolones as PARP inhibitors US Patent  US9617273 Publication Date 4/11/2017 
Target
Name:
Poly [ADP-ribose] polymerase 2
Synonyms:
(ARTD2 or PARP2) ADPRTL2 PARP2_HUMAN Poly [ADP-ribose] polymerase 2 (PARP2)
Type:
Enzyme
Mol. Mass.:
66225.70
Organism:
Homo sapiens (Human)
Description:
Q9UGN5
Residue:
583
  
Inhibitor
Name:
BDBM207596
Synonyms:
US10501467, Example 41 US9617273, Example 41
Type:
Small organic molecule
Emp. Form.:
C18H19N3O2
Mol. Mass.:
309.3624
SMILES:
CC1(C)Cc2n(CC3CO3)c3cccc4c3c2c(C1)n[nH]c4=O
: