Target
Cholinesterase
Ligand
BDBM10981
Substrate
BDBM8978
Meas. Tech.
Cholinesterase Inhibition Assay
IC50
66±n/a nM
Citation
 Yu, QHolloway, HWFlippen-Anderson, JLHoffman, BBrossi, AGreig, NH Methyl analogues of the experimental Alzheimer drug phenserine: synthesis and structure/activity relationships for acetyl- and butyrylcholinesterase inhibitory action. J Med Chem 44:4062-71 (2001)  
Target
Name:
Cholinesterase
Synonyms:
Acylcholine acylhydrolase Butyrylcholine esterase (BChE) Butyrylcholinesterase (BuChE) CHLE_HUMAN Cholinesterases Pseudocholinesterase
Type:
Homotetramer
Mol. Mass.:
68422.27
Organism:
Homo sapiens (Human)
Description:
P06276
Residue:
602
  
Inhibitor
Name:
BDBM10981
Synonyms:
(3aS,8aR)-1,3a,8-trimethyl-1,2,3,3a,8,8a-hexahydropyrrolo[2,3-b]indol-5-yl 3,4-dimethylphenylcarbamate 3,4-dimethylphrnserine | Phenserine methyl analog 8
Type:
Small organic molecule
Emp. Form.:
C22H27N3O2
Mol. Mass.:
365.4687
SMILES:
[H][C@]12N(C)CC[C@@]1(C)c1cc(OC(=O)Nc3ccc(C)c(C)c3)ccc1N2C
:
Substrate
Name:
BDBM8978
Synonyms:
(Propylcarbonylthioethyl)trimethylammonium iodide CHEMBL148530 butyrylthiocholine | butyrylthiocholine chloride
Type:
Small organic molecule
Emp. Form.:
C9H20NOS
Mol. Mass.:
190.326
SMILES:
CCCC(=O)SCC[N+](C)(C)C
: