Target
Poly [ADP-ribose] polymerase tankyrase-1
Ligand
BDBM318039
Substrate
Meas. Tech.
Biochemical Assay
IC50
14.3±4.89 nM
Citation
 Chedid, MEissa, HOEngler, TAFurness, KWRank, KBWoods, TAWrobleski, AD Pyrido[2,3-d]pyrimidin-4-one compounds as tankyrase inhibitors US Patent  US9624218 Publication Date 4/18/2017 
Target
Name:
Poly [ADP-ribose] polymerase tankyrase-1
Synonyms:
(ARTD5 or PARP5a) PARPL Poly [ADP-ribose] polymerase tankyrase-1 TINF1 TNKS1 Tankyrase 1 Tankyrase-1 Tankyrase-1 (TNKS1)
Type:
Enzyme
Mol. Mass.:
142058.03
Organism:
Homo sapiens (Human)
Description:
O95271
Residue:
1327
  
Inhibitor
Name:
BDBM318039
Synonyms:
2-[[4-(8-Methyl-4-oxo-3,5,6,7-tetrahydropyrido[2,3-d]pyrimidin-2-yl)piperazin-1-yl]methyl]pyridine-3-carbonitrile | US9624218, Example 40
Type:
Small organic molecule
Emp. Form.:
C19H23N7O
Mol. Mass.:
365.4322
SMILES:
CN1CCCc2c1nc([nH]c2=O)N1CCN(Cc2ncccc2C#N)CC1
: