Target
cAMP and cAMP-inhibited cGMP 3',5'-cyclic phosphodiesterase 10A
Ligand
BDBM187164
Substrate
Meas. Tech.
Phosphodiesterase Assay
pH
7.4±n/a
Temperature
298.15±n/a K
IC50
8.00±n/a nM
Comments
extracted
Citation
 Leblond, BChauvignac, CTaverne, TBeausoleil, ECasagrande, ADesire, LPando, MPDonello, JEYang, R Substituted 6,7-dialkoxy-3-isoquinolinol derivatives as inhibitors of phosphodiesterase 10 (PDE 10A) US Patent  US9670181 Publication Date 6/6/2017 
Target
Name:
cAMP and cAMP-inhibited cGMP 3',5'-cyclic phosphodiesterase 10A
Synonyms:
3',5'-cyclic phosphodiesterase PDE10_HUMAN Phosphodiesterase 10A
Type:
Protein
Mol. Mass.:
88412.52
Organism:
Homo sapiens (Human)
Description:
Q9Y233
Residue:
779
  
Inhibitor
Name:
BDBM187164
Synonyms:
US9670181, 44 4-((2-(benzylamino)-6-methoxyquinolin-3-yl)methyl)-1-ethyl-6,7-dimethoxyisoquinolin-3-ol
Type:
Small organic molecule
Emp. Form.:
C31H31N3O4
Mol. Mass.:
509.5955
SMILES:
CCc1nc(O)c(Cc2cc3cc(OC)ccc3nc2NCc2ccccc2)c2cc(OC)c(OC)cc12
: