Target
Carbonic anhydrase 2
Ligand
BDBM11049
Substrate
BDBM10856
Meas. Tech.
CA Inhibition Assay
Ki
9.1±n/a nM
Citation
 De Simone, GVitale, RMDi Fiore, APedone, CScozzafava, AMontero, JLWinum, JYSupuran, CT Carbonic anhydrase inhibitors: Hypoxia-activatable sulfonamides incorporating disulfide bonds that target the tumor-associated isoform IX. J Med Chem 49:5544-51 (2006)  
Target
Name:
Carbonic anhydrase 2
Synonyms:
CA-II CAC Carbonate dehydratase II Carbonic anhydrase 2 (CA-II) Carbonic anhydrase C Carbonic anhydrase II (CA-II) Carbonic anhydrase II (hCA II) | Carbonic anhydrase isoenzyme II (hCA II)
Type:
Enzyme
Mol. Mass.:
29250.71
Organism:
Homo sapiens (Human)
Description:
P00918
Residue:
260
  
Inhibitor
Name:
BDBM11049
Synonyms:
N-(5-sulfamoyl-1,3,4-thiadiazol-2-yl)-3-sulfanylpropanamide reduced thio H3
Type:
Small organic molecule
Emp. Form.:
C5H8N4O3S3
Mol. Mass.:
268.337
SMILES:
NS(=O)(=O)c1nnc(NC(=O)CCS)s1
:
Substrate
Name:
BDBM10856
Synonyms:
Carbon Dioxide | methanedione
Type:
Small organic molecule
Emp. Form.:
CO2
Mol. Mass.:
44.0095
SMILES:
O=C=O
: