Target
Ketohexokinase
Ligand
BDBM319583
Substrate
Meas. Tech.
KHK Assay B
IC50
1.50±n/a nM
Citation
 Dowling, MFernando, DFutatsugi, KHuard, KMagee, TVRaymer, BShavnya, ASmith, AThuma, BTsai, ATu, M Substituted 3-azabicyclo[3.1.0]hexanes as ketohexokinase inhibitors US Patent  US10174007 Publication Date 1/8/2019 
Target
Name:
Ketohexokinase
Synonyms:
Hepatic fructokinase KHK_HUMAN Ketohexokinase (KHK) | Ketohexokinase (KHK) Isoform C
Type:
Enzyme Catalytic Domain
Mol. Mass.:
32521.64
Organism:
Homo sapiens (Human)
Description:
Residue:
298
  
Inhibitor
Name:
BDBM319583
Synonyms:
US10174007, Example 2 US10988463, Example 2 | US11634410, Example 2
Type:
Small organic molecule
Emp. Form.:
C18H18ClF3N4O3
Mol. Mass.:
430.809
SMILES:
C[C@H]1[C@H](O)CN1c1nc(N2C[C@H]3[C@H](CC(O)=O)[C@H]3C2)c(Cl)c(c1C#N)C(F)(F)F
: