Target
5-hydroxytryptamine receptor 1A
Ligand
BDBM319630
Substrate
Meas. Tech.
5-HT1A Receptor Agonism Activity Test
EC50
0.680±n/a nM
Citation
 Jiang, HWang, ZLi, JZhang, RHe, YLiu, YBi, MLiu, ZTian, GChen, WYang, FWu, CWang, YJiang, XYin, JWang, GShen, J Heterocyclic compounds, process for preparation of the same and use thereof US Patent  US10174011 Publication Date 1/8/2019 
Target
Name:
5-hydroxytryptamine receptor 1A
Synonyms:
5-HT-1A 5-hydroxytryptamine receptor 1A (5-HT-1A) ADRB2RL1 Dopamine D2 receptor and serotonin 1a receptor HTR1A | Serotonin receptor 1A
Type:
Mol. Mass.:
46122.49
Organism:
Homo sapiens (Human)
Description:
Residue:
422
  
Inhibitor
Name:
BDBM319630
Synonyms:
6-(2-(4-(benzo[b]thiophen-4-yl)piperazin-1-yl)ethyl)-2H-benzo[b][1,4]thiazin-3(4H)-one | US10174011, Example 31
Type:
Small organic molecule
Emp. Form.:
C22H23N3OS2
Mol. Mass.:
409.568
SMILES:
O=C1CSc2ccc(CCN3CCN(CC3)c3cccc4sccc34)cc2N1
: