Target
Proto-oncogene tyrosine-protein kinase receptor Ret
Ligand
BDBM284233
Substrate
Meas. Tech.
RET Enzyme Assay
IC50
5.60±n/a nM
Citation
 Andrews, SWBlake, JFChicarelli, MJGolos, AHaas, JJiang, YKolakowski, GR Substituted pyrazolo[1,5-a]pyridine compounds as RET kinase inhibitors US Patent  US10174027 Publication Date 1/8/2019 
Target
Name:
Proto-oncogene tyrosine-protein kinase receptor Ret
Synonyms:
CDHF12 Cadherin family member 12 Proto-oncogene c-Ret RET51 Tyrosine-protein kinase Ret (RET)
Type:
Protein
Mol. Mass.:
124318.29
Organism:
Homo sapiens (Human)
Description:
P07949
Residue:
1114
  
Inhibitor
Name:
BDBM284233
Synonyms:
US10023570, Example 243 | US10174027, Example 243
Type:
Small organic molecule
Emp. Form.:
C25H23F3N8O
Mol. Mass.:
508.4983
SMILES:
Cn1cc(cn1)-c1cc(-c2ccc(nc2)N2CCC(CC2)C(=O)NCC(F)(F)F)c2c(cnn2c1)C#N
: