Target
Proto-oncogene tyrosine-protein kinase receptor Ret
Ligand
BDBM284419
Substrate
Meas. Tech.
RET Enzyme Assay
IC50
9.10±n/a nM
Citation
 Andrews, SWBlake, JFChicarelli, MJGolos, AHaas, JJiang, YKolakowski, GR Substituted pyrazolo[1,5-a]pyridine compounds as RET kinase inhibitors US Patent  US10174027 Publication Date 1/8/2019 
Target
Name:
Proto-oncogene tyrosine-protein kinase receptor Ret
Synonyms:
CDHF12 Cadherin family member 12 Proto-oncogene c-Ret RET51 Tyrosine-protein kinase Ret (RET)
Type:
Protein
Mol. Mass.:
124318.29
Organism:
Homo sapiens (Human)
Description:
P07949
Residue:
1114
  
Inhibitor
Name:
BDBM284419
Synonyms:
4-(6-(4-(2,5- difluorobenzyl)piperazin- 1-yl)pyridin-3-yl)-6-(1- methyl-1H-pyrazol-4- yl)pyrazolo[1,5-a]pyridine- 3-carbonitrile US10174028, Example 429
Type:
Small organic molecule
Emp. Form.:
C28H24F2N8
Mol. Mass.:
510.5406
SMILES:
Cn1cc(cn1)-c1cc(-c2ccc(nc2)N2CCN(Cc3cc(F)ccc3F)CC2)c2c(cnn2c1)C#N
: