Target
Proto-oncogene tyrosine-protein kinase receptor Ret
Ligand
BDBM284441
Substrate
Meas. Tech.
RET Enzyme Assay
IC50
4.90±n/a nM
Citation
 Andrews, SWBlake, JFChicarelli, MJGolos, AHaas, JJiang, YKolakowski, GR Substituted pyrazolo[1,5-A]pyridine compounds as RET kinase inhibitors US Patent  US10174028 Publication Date 1/8/2019 
Target
Name:
Proto-oncogene tyrosine-protein kinase receptor Ret
Synonyms:
CDHF12 Cadherin family member 12 Proto-oncogene c-Ret RET51 Tyrosine-protein kinase Ret (RET)
Type:
Protein
Mol. Mass.:
124318.29
Organism:
Homo sapiens (Human)
Description:
P07949
Residue:
1114
  
Inhibitor
Name:
BDBM284441
Synonyms:
4-(6-(4-(2- methoxybenzyl)piperazin- 1-yl)pyridin-3-yl)-6-(1- methyl-1H-pyrazol-4- yl)pyrazolo[1,5-a]pyridine- 3-carbonitrile US10174028, Example 451
Type:
Small organic molecule
Emp. Form.:
C29H28N8O
Mol. Mass.:
504.5856
SMILES:
COc1ccccc1CN1CCN(CC1)c1ccc(cn1)-c1cc(cn2ncc(C#N)c12)-c1cnn(C)c1
: