Target
Replicase polyprotein 1ab
Ligand
BDBM11254
Substrate
fluorogenic substrate peptide
Meas. Tech.
SARS-CoV 3CL Protease Inhibition Assay
pH
7±n/a
Temperature
298.15±n/a K
IC50
38000±n/a nM
Citation
 Shie, JJFang, JMKuo, THKuo, CJLiang, PHHuang, HJWu, YTJan, JTCheng, YSWong, CH Inhibition of the severe acute respiratory syndrome 3CL protease by peptidomimetic alpha,beta-unsaturated esters. Bioorg Med Chem 13:5240-52 (2005)  
Target
Name:
Replicase polyprotein 1ab
Synonyms:
3C-like proteinase 3C-like proteinase (SARS-CoV 3Cpro) 3CLp GFL Guanine-N7 methyltransferase Helicase Leader protein Non-structural protein 10 Non-structural protein 3 Non-structural protein 6 Non-structural protein 8 ORF1ab polyprotein PL2-PRO Pol R1AB_SARS RdRp SARS coronavirus main proteinase nsp1 nsp12 nsp14 nsp16 nsp3 nsp5 nsp7 nsp9 pp1ab | rep
Type:
Protein
Mol. Mass.:
790250.81
Organism:
Human SARS coronavirus (SARS-CoV) (Severe acute respiratory syndrome coronavirus)
Description:
P0C6X7
Residue:
7073
  
Inhibitor
Name:
BDBM11254
Synonyms:
AG7088 analogue 3d | ethyl (2E,4S)-4-[(2R,5S)-2-benzyl-5-{[(benzyloxy)carbonyl]amino}-6-methyl-4-oxoheptanamido]-5-phenylpent-2-enoate
Type:
Small organic molecule
Emp. Form.:
C36H42N2O6
Mol. Mass.:
598.7285
SMILES:
CCOC(=O)\C=C\[C@H](Cc1ccccc1)NC(=O)[C@@H](CC(=O)[C@@H](NC(=O)OCc1ccccc1)C(C)C)Cc1ccccc1
:
Substrate
Name:
fluorogenic substrate peptide
Synonyms:
Type:
Peptide
Mol. Mass.:
2662.93
Organism:
Description:
Residue:
24