Target
Replicase polyprotein 1ab
Ligand
BDBM11293
Substrate
fluorogenic substrate peptide
Meas. Tech.
SARS-CoV 3CL Protease Inhibition Assay
pH
7±n/a
Temperature
298.15±n/a K
IC50
900±100 nM
Citation
 Lu, ILMahindroo, NLiang, PHPeng, YHKuo, CJTsai, KCHsieh, HPChao, YSWu, SY Structure-based drug design and structural biology study of novel nonpeptide inhibitors of severe acute respiratory syndrome coronavirus main protease. J Med Chem 49:5154-61 (2006)  
Target
Name:
Replicase polyprotein 1ab
Synonyms:
3C-like proteinase 3C-like proteinase (SARS-CoV 3Cpro) 3CLp GFL Guanine-N7 methyltransferase Helicase Leader protein Non-structural protein 10 Non-structural protein 3 Non-structural protein 6 Non-structural protein 8 ORF1ab polyprotein PL2-PRO Pol R1AB_SARS RdRp SARS coronavirus main proteinase nsp1 nsp12 nsp14 nsp16 nsp3 nsp5 nsp7 nsp9 pp1ab | rep
Type:
Protein
Mol. Mass.:
790250.81
Organism:
Human SARS coronavirus (SARS-CoV) (Severe acute respiratory syndrome coronavirus)
Description:
P0C6X7
Residue:
7073
  
Inhibitor
Name:
BDBM11293
Synonyms:
4-({4-[(2,3,3-trichloroprop-2-enoyl)oxy]benzene}sulfonyl)phenyl 2,3,3-trichloroprop-2-enoate acs.jmedchem.1c00409_ST.230
Type:
Small organic molecule
Emp. Form.:
C18H8Cl6O6S
Mol. Mass.:
565.036
SMILES:
Cl\[#6](Cl)=[#6](\Cl)-[#6](=O)-[#8]-c1ccc(cc1)S(=O)(=O)c1ccc(-[#8]-[#6](=O)-[#6](\Cl)=[#6](/Cl)Cl)cc1
:
Substrate
Name:
fluorogenic substrate peptide
Synonyms:
Type:
Peptide
Mol. Mass.:
2662.93
Organism:
Description:
Residue:
24