Target
Guanylate cyclase soluble subunit alpha-1
Ligand
BDBM321625
Substrate
Meas. Tech.
sGC-HEK-cGMP Assay
EC50
<100±n/a nM
Citation
 Nakai, TJia, JRenhowe, PABarden, TCYu, XYSheppeck, JEIyer, KJung, JMilne, GTLong, KKCurrie, MGMoore, JPerl, NRIyengar, RRMermerian, AIm, GJLee, TWHudson, CRennie, GR sGC stimulators US Patent  US10183021 Publication Date 1/22/2019 
Target
Name:
Guanylate cyclase soluble subunit alpha-1
Synonyms:
GCS-alpha-1 GCYA1_HUMAN GUCSA3 GUCY1A3 Guanylate cyclase soluble subunit alpha-3 Solube guanylate cyclase alpha-1 (sGCalpha) | soluble guanylate cyclase alpha-1 (sGC)
Type:
Enzyme
Mol. Mass.:
77457.21
Organism:
Homo sapiens (Human)
Description:
Q02108
Residue:
690
  
Inhibitor
Name:
BDBM321625
Synonyms:
US10183021, Compound I-426
Type:
Small organic molecule
Emp. Form.:
C24H23F2N7O4S
Mol. Mass.:
543.546
SMILES:
CC(=O)NS(=O)(=O)C1CCN(CC1)c1nc(ncc1F)-c1cc(-c2ccon2)n(Cc2ccccc2F)n1
: