Target
Carbonic anhydrase 2
Ligand
BDBM11394
Substrate
BDBM10856
Meas. Tech.
CA Inhibition Assay
pH
7.2±n/a
Temperature
277.15±n/a K
IC50
0.82±n/a nM
Citation
 Chen, HHGross, SLiao, JMcLaughlin, MDean, TSly, WSMay, JA 2H-Thieno[3,2-e]- and [2,3-e]-1,2-thiazine-6-sulfonamide 1,1-dioxides as ocular hypotensive agents: synthesis, carbonic anhydrase inhibition and evaluation in the rabbit. Bioorg Med Chem 8:957-75 (2000)  
Target
Name:
Carbonic anhydrase 2
Synonyms:
CA-II CAC Carbonate dehydratase II Carbonic anhydrase 2 (CA-II) Carbonic anhydrase C Carbonic anhydrase II (CA-II) Carbonic anhydrase II (hCA II) | Carbonic anhydrase isoenzyme II (hCA II)
Type:
Enzyme
Mol. Mass.:
29250.71
Organism:
Homo sapiens (Human)
Description:
P00918
Residue:
260
  
Inhibitor
Name:
BDBM11394
Synonyms:
2-[2-(4-Morpholinyl)ethyl]-2H-thieno[3,2-e]-1,2-thiazine-6-sulfonamide 1,1-dioxide hydrochloride 2H-Thieno[3,2-e]-1,2-thiazine-6-sulfonamide 1,1-dioxide 2 | Compound 5b
Type:
Small organic molecule
Emp. Form.:
C12H17N3O5S3
Mol. Mass.:
379.475
SMILES:
NS(=O)(=O)c1cc2C=CN(CCN3CCOCC3)S(=O)(=O)c2s1
:
Substrate
Name:
BDBM10856
Synonyms:
Carbon Dioxide | methanedione
Type:
Small organic molecule
Emp. Form.:
CO2
Mol. Mass.:
44.0095
SMILES:
O=C=O
: