Target
Carbonic anhydrase 2
Ligand
BDBM11399
Substrate
BDBM10856
Meas. Tech.
CA Inhibition Assay
pH
7.2±n/a
Temperature
277.15±n/a K
IC50
1.11±n/a nM
Citation
 Chen, HHGross, SLiao, JMcLaughlin, MDean, TSly, WSMay, JA 2H-Thieno[3,2-e]- and [2,3-e]-1,2-thiazine-6-sulfonamide 1,1-dioxides as ocular hypotensive agents: synthesis, carbonic anhydrase inhibition and evaluation in the rabbit. Bioorg Med Chem 8:957-75 (2000)  
Target
Name:
Carbonic anhydrase 2
Synonyms:
CA-II CAC Carbonate dehydratase II Carbonic anhydrase 2 (CA-II) Carbonic anhydrase C Carbonic anhydrase II (CA-II) Carbonic anhydrase II (hCA II) | Carbonic anhydrase isoenzyme II (hCA II)
Type:
Enzyme
Mol. Mass.:
29250.71
Organism:
Homo sapiens (Human)
Description:
P00918
Residue:
260
  
Inhibitor
Name:
BDBM11399
Synonyms:
2H-Thieno[3,2-e]-1,2-thiazine-6-sulfonamide 1,1-dioxide 9 3-{[(2-methoxyethyl)(prop-2-en-1-yl)amino]methyl}-2-methyl-1,1-dioxo-2H-1,7,2-thieno[3,2-e][1,2]thiazine-6-sulfonamide hydrochloride | Compound 17a7
Type:
Small organic molecule
Emp. Form.:
C14H21N3O5S3
Mol. Mass.:
407.529
SMILES:
COCCN(CC=C)CC1=Cc2cc(sc2S(=O)(=O)N1C)S(N)(=O)=O
:
Substrate
Name:
BDBM10856
Synonyms:
Carbon Dioxide | methanedione
Type:
Small organic molecule
Emp. Form.:
CO2
Mol. Mass.:
44.0095
SMILES:
O=C=O
: