Target
Neuronal acetylcholine receptor subunit alpha-7
Ligand
BDBM322282
Substrate
Meas. Tech.
Human alpha7 nAChR Binding Assay
Ki
220±n/a nM
Citation
 Acharya, RBurnett, DABursavich, MGCook, ASHarrison, BAKoenig, GMcriner, AJ Geminal substituted quinuclidine amide compounds as agonists of α-7 nicotonic acetylcholine receptors US Patent  US10183938 Publication Date 1/22/2019 
Target
Name:
Neuronal acetylcholine receptor subunit alpha-7
Synonyms:
ACHA7_HUMAN Cholinergic, Nicotinic Alpha7 Neuronal acetylcholine receptor protein alpha-7 subunit Nicotinic acetylcholine receptor alpha-7 (alpha7 nAChR)
Type:
Mol. Mass.:
56448.33
Organism:
Homo sapiens (Human)
Description:
CHRNA7 (NACHRA7)
Residue:
502
  
Inhibitor
Name:
BDBM322282
Synonyms:
6-fluoro-N-(1'-azaspiro[cyclopropane-1,2'-bicyclo[2.2.2]octan]-3'-yl)benzo[b]thiophene-2-carboxamide | US10183938, Compound 61a
Type:
Small organic molecule
Emp. Form.:
C18H19FN2OS
Mol. Mass.:
330.42
SMILES:
Fc1ccc2cc(sc2c1)C(=O)NC1C2CCN(CC2)C11CC1
: