Target
5-hydroxytryptamine receptor 3A
Ligand
BDBM322437
Substrate
Meas. Tech.
[3H]BRL 43694 Competition Binding (h-5HT3 Assay
Ki
160±n/a nM
Citation
 Acharya, RBurnett, DABursavich, MGCook, ASHarrison, BAKoenig, GMcriner, AJ Geminal substituted quinuclidine amide compounds as agonists of α-7 nicotonic acetylcholine receptors US Patent  US10183938 Publication Date 1/22/2019 
Target
Name:
5-hydroxytryptamine receptor 3A
Synonyms:
5-HT-3 5-HT3A 5-hydroxytryptamine receptor 3 (5-HT3) 5-hydroxytryptamine receptor 3A (5HT3A) 5HT3R HTR3A Serotonin 3 receptor (5HT3) Serotonin-gated ion channel receptor | Serotonin-gated ion channel receptor 3
Type:
Protein
Mol. Mass.:
55283.27
Organism:
Homo sapiens (Human)
Description:
P46098
Residue:
478
  
Inhibitor
Name:
BDBM322437
Synonyms:
(R)-7-isopropoxy-N-(1'-azaspiro[cyclopropane-1,2'-bicyclo[2.2.2]octan]-3'-yl)benzo[b]thiophene-2-carboxamide | US10183938, Compound (R)-191
Type:
Small organic molecule
Emp. Form.:
C21H26N2O2S
Mol. Mass.:
370.508
SMILES:
CC(C)Oc1cccc2cc(sc12)C(=O)N[C@@H]1C2CCN(CC2)C11CC1
: