Target
Nuclear receptor ROR-gamma
Ligand
BDBM189880
Substrate
Meas. Tech.
Assay of Co-Activator Recruitment by TR-FRET
pH
7.5±n/a
Temperature
298.15±n/a K
IC50
5.40±n/a nM
Comments
extracted
Citation
 Wennerstål, GMZamaratski, E Methyl- and trifluoromethyl-substituted pyrrolopyridine modulators of RORC2 and methods of use thereof US Patent  US9670201 Publication Date 6/6/2017 
Target
Name:
Nuclear receptor ROR-gamma
Synonyms:
NR1F3 Nuclear receptor ROR-gamma (RORC) RAR-related orphan receptor C (RORc) RORG RZRG Retinoid-related orphan receptor-gamma (RORc)
Type:
Enzyme Catalytic Domain
Mol. Mass.:
58218.40
Organism:
Homo sapiens (Human)
Description:
P51449
Residue:
518
  
Inhibitor
Name:
BDBM189880
Synonyms:
US10227346, Example 8 US9670201, 8 3-cyano-N-(3-(1-isobutyrylpiperidin-4-yl)-1-methyl-4-(trifluoromethyl)-1H-pyrrolo[2,3-b]pyridin-5-yl)-5-methoxybenzamide | US9920054, Example 8
Type:
Small organic molecule
Emp. Form.:
C27H28F3N5O3
Mol. Mass.:
527.5381
SMILES:
COc1cc(cc(c1)C(=O)Nc1cnc2n(C)cc(C3CCN(CC3)C(=O)C(C)C)c2c1C(F)(F)F)C#N
: