Target
Diacylglycerol O-acyltransferase 2
Ligand
BDBM323643
Substrate
Meas. Tech.
In Vitro DGAT2 Assay
IC50
26.7±n/a nM
Citation
 Futatsugi, K Diacylglycerol acyltransferase 2 inhibitors US Patent  US10188653 Publication Date 1/29/2019 
Target
Name:
Diacylglycerol O-acyltransferase 2
Synonyms:
ARAT DGAT2 Diacylglycerol O-acyltransferase 2 (DGAT2) Retinol O-fatty-acyltransferase
Type:
Multi-pass membrane protein
Mol. Mass.:
43848.90
Organism:
Homo sapiens (Human)
Description:
Q96PD7
Residue:
388
  
Inhibitor
Name:
BDBM323643
Synonyms:
(R)-azetidin-1-yl(2-(3-(2- ethoxyphenoxy)piperidin- 1-yl)pyrimidin-5- yl)methanone US9789110, 19.11
Type:
Small organic molecule
Emp. Form.:
C21H26N4O3
Mol. Mass.:
382.4561
SMILES:
CCOc1ccccc1O[C@@H]1CCCN(C1)c1ncc(cn1)C(=O)N1CCC1
: