Target
Serine/threonine-protein kinase B-raf [416-766,V600E]
Ligand
BDBM186814
Substrate
Meas. Tech.
Raf IC50 Assay
Temperature
298.15±n/a K
IC50
1900±n/a nM
Comments
extracted
Citation
 Zhou, CZhang, G Fused tricyclic urea compounds as Raf kinase and/or Raf kinase dimer inhibitors US Patent  US9670203 Publication Date 6/6/2017 
Target
Name:
Serine/threonine-protein kinase B-raf [416-766,V600E]
Synonyms:
B-Raf (V600E) BRAF1 RAFB1
Type:
Mol. Mass.:
39690.71
Organism:
Homo sapiens (Human)
Description:
PV3849, from Invitrogen
Residue:
351
  
Inhibitor
Name:
BDBM186814
Synonyms:
US9670203, Compound 1.6
Type:
Small organic molecule
Emp. Form.:
C25H21ClN4O5
Mol. Mass.:
492.911
SMILES:
COc1cccc(NC(=O)N[C@@H]2[C@H]3Oc4ccc(Oc5ccnc6NC(=O)CCc56)cc4[C@@H]23)c1Cl
: