Target
Serine/threonine-protein kinase B-raf [416-766,V600E]
Ligand
BDBM186825
Substrate
Meas. Tech.
Raf IC50 Assay
Temperature
298.15±n/a K
IC50
1500±n/a nM
Comments
extracted
Citation
 Zhou, CZhang, G Fused tricyclic urea compounds as Raf kinase and/or Raf kinase dimer inhibitors US Patent  US9670203 Publication Date 6/6/2017 
Target
Name:
Serine/threonine-protein kinase B-raf [416-766,V600E]
Synonyms:
B-Raf (V600E) BRAF1 RAFB1
Type:
Mol. Mass.:
39690.71
Organism:
Homo sapiens (Human)
Description:
PV3849, from Invitrogen
Residue:
351
  
Inhibitor
Name:
BDBM186825
Synonyms:
US9670203, Compound 1.17
Type:
Small organic molecule
Emp. Form.:
C26H24N4O6
Mol. Mass.:
488.492
SMILES:
COc1cc(NC(=O)N[C@@H]2[C@H]3Oc4ccc(Oc5ccnc6NC(=O)CCc56)cc4[C@@H]23)cc(OC)c1
: