Target
Serine/threonine-protein kinase B-raf [416-766,V600E]
Ligand
BDBM186827
Substrate
Meas. Tech.
Raf IC50 Assay
Temperature
298.15±n/a K
IC50
5100±n/a nM
Comments
extracted
Citation
 Zhou, CZhang, G Fused tricyclic urea compounds as Raf kinase and/or Raf kinase dimer inhibitors US Patent  US9670203 Publication Date 6/6/2017 
Target
Name:
Serine/threonine-protein kinase B-raf [416-766,V600E]
Synonyms:
B-Raf (V600E) BRAF1 RAFB1
Type:
Mol. Mass.:
39690.71
Organism:
Homo sapiens (Human)
Description:
PV3849, from Invitrogen
Residue:
351
  
Inhibitor
Name:
BDBM186827
Synonyms:
US9670203, Compound 1.19
Type:
Small organic molecule
Emp. Form.:
C25H21ClN4O4
Mol. Mass.:
476.912
SMILES:
Cc1cccc(Cl)c1NC(=O)N[C@@H]1[C@H]2Oc3ccc(Oc4ccnc5NC(=O)CCc45)cc3[C@@H]12
: