Target
Serine/threonine-protein kinase B-raf [416-766,V600E]
Ligand
BDBM189850
Substrate
Meas. Tech.
Raf IC50 Assay
Temperature
298.15±n/a K
IC50
>5000000±n/a nM
Comments
extracted
Citation
 Zhou, CZhang, G Fused tricyclic urea compounds as Raf kinase and/or Raf kinase dimer inhibitors US Patent  US9670203 Publication Date 6/6/2017 
Target
Name:
Serine/threonine-protein kinase B-raf [416-766,V600E]
Synonyms:
B-Raf (V600E) BRAF1 RAFB1
Type:
Mol. Mass.:
39690.71
Organism:
Homo sapiens (Human)
Description:
PV3849, from Invitrogen
Residue:
351
  
Inhibitor
Name:
BDBM189850
Synonyms:
US9670203, Compound 1.63
Type:
Small organic molecule
Emp. Form.:
C30H32N6O4
Mol. Mass.:
540.6129
SMILES:
CN1CCN(Cc2ccc(NC(=O)N[C@@H]3[C@H]4Oc5ccc(Oc6ccnc7NC(=O)CCc67)cc5[C@@H]34)cc2)CC1
: