Target
Serine/threonine-protein kinase B-raf [416-766,V600E]
Ligand
BDBM190858
Substrate
Meas. Tech.
Raf IC50 Assay
Temperature
298.15±n/a K
IC50
3000±n/a nM
Comments
extracted
Citation
 Zhou, CZhang, G Fused tricyclic urea compounds as Raf kinase and/or Raf kinase dimer inhibitors US Patent  US9670203 Publication Date 6/6/2017 
Target
Name:
Serine/threonine-protein kinase B-raf [416-766,V600E]
Synonyms:
B-Raf (V600E) BRAF1 RAFB1
Type:
Mol. Mass.:
39690.71
Organism:
Homo sapiens (Human)
Description:
PV3849, from Invitrogen
Residue:
351
  
Inhibitor
Name:
BDBM190858
Synonyms:
US9670203, Compound 1.71 1-((1R,1aR,6bR)-5-((7-oxo-5,6,7,8-tetrahydro-1,8-naphthyridin-4-yl)oxy)-1a,6b-dihydro-1H-cyclopropa[b]benzofuran-1-yl)-3-(3-(trifluoromethyl)phenyl)urea
Type:
Small organic molecule
Emp. Form.:
C25H19F3N4O4
Mol. Mass.:
496.438
SMILES:
FC(F)(F)c1cccc(NC(=O)N[C@H]2[C@@H]3Oc4ccc(Oc5ccnc6NC(=O)CCc56)cc4[C@H]23)c1
: