Target
Serine/threonine-protein kinase B-raf [416-766,V600E]
Ligand
BDBM190901
Substrate
Meas. Tech.
Raf IC50 Assay
Temperature
298.15±n/a K
IC50
3400±n/a nM
Comments
extracted
Citation
 Zhou, CZhang, G Fused tricyclic urea compounds as Raf kinase and/or Raf kinase dimer inhibitors US Patent  US9670203 Publication Date 6/6/2017 
Target
Name:
Serine/threonine-protein kinase B-raf [416-766,V600E]
Synonyms:
B-Raf (V600E) BRAF1 RAFB1
Type:
Mol. Mass.:
39690.71
Organism:
Homo sapiens (Human)
Description:
PV3849, from Invitrogen
Residue:
351
  
Inhibitor
Name:
BDBM190901
Synonyms:
US9670203, Compound 1.76
Type:
Small organic molecule
Emp. Form.:
C26H20F4N4O4
Mol. Mass.:
528.455
SMILES:
Fc1ccc(CNC(=O)NC2[C@H]3Oc4ccc(Oc5ccnc6NC(=O)CCc56)cc4[C@@H]23)c(c1)C(F)(F)F
: