Target
Serine/threonine-protein kinase B-raf [416-766,V600E]
Ligand
BDBM191343
Substrate
Meas. Tech.
Raf IC50 Assay
Temperature
298.15±n/a K
IC50
33000±n/a nM
Comments
extracted
Citation
 Zhou, CZhang, G Fused tricyclic urea compounds as Raf kinase and/or Raf kinase dimer inhibitors US Patent  US9670203 Publication Date 6/6/2017 
Target
Name:
Serine/threonine-protein kinase B-raf [416-766,V600E]
Synonyms:
B-Raf (V600E) BRAF1 RAFB1
Type:
Mol. Mass.:
39690.71
Organism:
Homo sapiens (Human)
Description:
PV3849, from Invitrogen
Residue:
351
  
Inhibitor
Name:
BDBM191343
Synonyms:
US9670203, Compound 2.7
Type:
Small organic molecule
Emp. Form.:
C24H18F4N4O4
Mol. Mass.:
502.4177
SMILES:
CNC(=O)c1cc(Oc2ccc3O[C@@H]4[C@@H](NC(=O)Nc5ccc(F)c(c5)C(F)(F)F)[C@@H]4c3c2)ccn1
: