Target
Dipeptidyl peptidase 4
Ligand
BDBM11537
Substrate
BDBM11526
Meas. Tech.
In Vitro DPP-IV Inhibition Assays
pH
7.4±n/a
Temperature
295.15±n/a K
Ki
42±4 nM
Citation
 Augeri, DJRobl, JABetebenner, DAMagnin, DRKhanna, ARobertson, JGWang, ASimpkins, LMTaunk, PHuang, QHan, SPAbboa-Offei, BCap, MXin, LTao, LTozzo, EWelzel, GEEgan, DMMarcinkeviciene, JChang, SYBiller, SAKirby, MSParker, RAHamann, LG Discovery and preclinical profile of Saxagliptin (BMS-477118): a highly potent, long-acting, orally active dipeptidyl peptidase IV inhibitor for the treatment of type 2 diabetes. J Med Chem 48:5025-37 (2005)  
Target
Name:
Dipeptidyl peptidase 4
Synonyms:
ADABP Adenosine deaminase complexing protein 2 CD_antigen=CD26 DPP4 DPPIV Dipeptidyl peptidase 4 (DPP IV) Dipeptidyl peptidase 4 (DPP4) Dipeptidyl peptidase 4 membrane form Dipeptidyl peptidase IV Dipeptidyl peptidase IV (DDP-IV) Dipeptidyl peptidase IV membrane form Dipeptidyl peptidase-IV (DPP-4) T-cell activation antigen CD26 | TP103
Type:
Enzyme
Mol. Mass.:
88271.01
Organism:
Homo sapiens (Human)
Description:
P27487
Residue:
766
  
Inhibitor
Name:
BDBM11537
Synonyms:
(1S,3S,5S)-2-[(2S)-2-amino-2-[1-(hydroxymethyl)cyclobutyl]acetyl]-2-azabicyclo[3.1.0]hexane-3-carbonitrile; 2,2,2-trifluoroacetic acid BMS-477118 analogue | Saxagliptin Analogue 16c
Type:
Small organic molecule
Emp. Form.:
C13H19N3O2
Mol. Mass.:
249.3089
SMILES:
N[C@H](C(=O)N1[C@H]2C[C@H]2C[C@H]1C#N)C1(CO)CCC1
:
Substrate
Name:
BDBM11526
Synonyms:
1-(2-aminoacetyl)-N-(4-nitrophenyl)pyrrolidine-2-carboxamide Gly-Pro-pNA
Type:
Small organic molecule
Emp. Form.:
C13H16N4O4
Mol. Mass.:
292.2905
SMILES:
NCC(=O)N1CCCC1C(=O)Nc1ccc(cc1)[N+]([O-])=O
: