Target
Dipeptidyl peptidase 4
Ligand
BDBM11555
Substrate
BDBM11057
Meas. Tech.
DPPIV Inhibition Assay
pH
7.4±n/a
Temperature
298.15±n/a K
IC50
33000±n/a nM
Citation
 Nordhoff, SCerezo-Galvez, SFeurer, AHill, OMatassa, VGMetz, GRummey, CThiemann, MEdwards, PJ The reversed binding of beta-phenethylamine inhibitors of DPP-IV: X-ray structures and properties of novel fragment and elaborated inhibitors. Bioorg Med Chem Lett 16:1744-8 (2006)  
Target
Name:
Dipeptidyl peptidase 4
Synonyms:
ADABP Adenosine deaminase complexing protein 2 CD_antigen=CD26 DPP4 DPPIV Dipeptidyl peptidase 4 (DPP IV) Dipeptidyl peptidase 4 (DPP4) Dipeptidyl peptidase 4 membrane form Dipeptidyl peptidase IV Dipeptidyl peptidase IV (DDP-IV) Dipeptidyl peptidase IV membrane form Dipeptidyl peptidase-IV (DPP-4) T-cell activation antigen CD26 | TP103
Type:
Enzyme
Mol. Mass.:
88271.01
Organism:
Homo sapiens (Human)
Description:
P27487
Residue:
766
  
Inhibitor
Name:
BDBM11555
Synonyms:
(1-phenylcyclopentyl)methanamine CHEMBL382127 | beta-phenethylamine 5
Type:
Small organic molecule
Emp. Form.:
C12H17N
Mol. Mass.:
175.2701
SMILES:
NCC1(CCCC1)c1ccccc1
:
Substrate
Name:
BDBM11057
Synonyms:
1-(2-aminoacetyl)-N-(4-methyl-2-oxo-2H-chromen-7-yl)pyrrolidine-2-carboxamide hydrobromide Gly-Pro-7-amidomethylcoumarin | Gly-Pro-AMC
Type:
Small organic molecule
Emp. Form.:
C17H19N3O4
Mol. Mass.:
329.3505
SMILES:
Cc1cc(=O)oc2cc(NC(=O)C3CCCN3C(=O)CN)ccc12
: