Target
Dipeptidyl peptidase 4
Ligand
BDBM11556
Substrate
BDBM11057
Meas. Tech.
DPPIV Inhibition Assay
pH
7.4±n/a
Temperature
298.15±n/a K
IC50
46000±n/a nM
Citation
 Nordhoff, SCerezo-Galvez, SFeurer, AHill, OMatassa, VGMetz, GRummey, CThiemann, MEdwards, PJ The reversed binding of beta-phenethylamine inhibitors of DPP-IV: X-ray structures and properties of novel fragment and elaborated inhibitors. Bioorg Med Chem Lett 16:1744-8 (2006)  
Target
Name:
Dipeptidyl peptidase 4
Synonyms:
CD26 DPP IV DPP4_PIG Dipeptidyl peptidase 4 membrane form Dipeptidyl peptidase IV Dipeptidyl peptidase IV soluble form | T-cell activation antigen CD26
Type:
Enzyme
Mol. Mass.:
88235.21
Organism:
Sus scrofa (pig)
Description:
Residue:
766
  
Inhibitor
Name:
BDBM11556
Synonyms:
2-(2-chlorophenyl)-2-(morpholin-4-yl)ethan-1-amine beta-phenethylamine 6
Type:
Small organic molecule
Emp. Form.:
C12H17ClN2O
Mol. Mass.:
240.729
SMILES:
NCC(N1CCOCC1)c1ccccc1Cl
:
Substrate
Name:
BDBM11057
Synonyms:
1-(2-aminoacetyl)-N-(4-methyl-2-oxo-2H-chromen-7-yl)pyrrolidine-2-carboxamide hydrobromide Gly-Pro-7-amidomethylcoumarin | Gly-Pro-AMC
Type:
Small organic molecule
Emp. Form.:
C17H19N3O4
Mol. Mass.:
329.3505
SMILES:
Cc1cc(=O)oc2cc(NC(=O)C3CCCN3C(=O)CN)ccc12
: