Target
Ubiquitin carboxyl-terminal hydrolase 1
Ligand
BDBM325063
Substrate
Meas. Tech.
Ubitquin-Rhodamine 110 Assay for USP1 Activity
IC50
<50±n/a nM
Citation
 Buckmelter, AJIoannidis, SFollows, BGustafson, GWang, MCaravella, JAWang, ZFritzen, ELLin, J Purinones as ubiquitin-specific protease 1 inhibitors US Patent  US10189841 Publication Date 1/29/2019 
Target
Name:
Ubiquitin carboxyl-terminal hydrolase 1
Synonyms:
Deubiquitinating enzyme 1 USP1 Ubiquitin thioesterase 1 hUBP
Type:
PROTEIN
Mol. Mass.:
88191.62
Organism:
Homo sapiens (Human)
Description:
ChEMBL_104169
Residue:
785
  
Inhibitor
Name:
BDBM325063
Synonyms:
9-(4-(imidazo[1,2-a]pyridin-8-yl)benzyl)-2-(2- US10399980, Compound I-269 | US11161848, Compound I-269
Type:
Small organic molecule
Emp. Form.:
C29H26N6O
Mol. Mass.:
474.5563
SMILES:
CC(C)c1ccccc1-c1ncc2n(C)c(=O)n(Cc3ccc(cc3)-c3cccn4ccnc34)c2n1
: